BDBM50111102 (S)-1-((R)-3-Cyclohexyl-2-methanesulfonylamino-propionyl)-pyrrolidine-2-carboxylic acid 4-carbamimidoyl-benzylamide::CHEMBL7860
SMILES CS(=O)(=O)N[C@H](CC1CCCCC1)C(=O)N1CCC[C@H]1C(=O)NCc1ccc(cc1)C(N)=N
InChI Key InChIKey=UQMOAGGBXALCSZ-UXHICEINSA-N
Data  3 KI
  Tab Delimited (TSV)   2D SDfile   Computed 3D by Vconf -m prep SDfile
Find this compound or compounds like it in BindingDB:
Activity Spreadsheet -- Enzyme Inhibition Constant Data from BindingDB
Found 3 hits for monomerid = 50111102
TargetProthrombin(Homo sapiens (Human))
Life Science R & D, Lgci
Curated by ChEMBL
LigandPNGBDBM50111102((S)-1-((R)-3-Cyclohexyl-2-methanesulfonylamino-pro...)
Affinity DataKi:  0.0200nM. Assay description: Binding affinity against human thrombin
In DepthDetails ArticlePubMed
TargetSerine protease 1(Bos taurus (bovine))
Life Science R & D, Lgci
Curated by ChEMBL
LigandPNGBDBM50111102((S)-1-((R)-3-Cyclohexyl-2-methanesulfonylamino-pro...)
Affinity DataKi:  1.30nM. Assay description: Binding affinity against bovine trypsin
In DepthDetails ArticlePubMed
TargetCoagulation factor X(Homo sapiens (Human))
Life Science R & D, Lgci
Curated by ChEMBL
LigandPNGBDBM50111102((S)-1-((R)-3-Cyclohexyl-2-methanesulfonylamino-pro...)
Affinity DataKi:  200nM. Assay description: Compound was evaluated for the binding affinity against human Coagulation factor Xa
In DepthDetails ArticlePubMed