BDBM50111128 CHEMBL3604764
SMILES CN(C)C(=O)c1cccc2c(NCc3cccc(Cl)c3Cl)cc(C)nc12
InChI Key InChIKey=WBNUPZCXMXTUAY-UHFFFAOYSA-N
Data  1 IC50
  Tab Delimited (TSV)   2D SDfile   Computed 3D by Vconf -m prep SDfile
Find this compound or compounds like it in BindingDB:
Activity Spreadsheet -- Enzyme Inhibition Constant Data from BindingDB
Found 1 hit for monomerid = 50111128
TargetADP-ribosyl cyclase/cyclic ADP-ribose hydrolase 1(Homo sapiens (Human))
Glaxosmithkline
Curated by ChEMBL
LigandPNGBDBM50111128(CHEMBL3604764)
Affinity DataIC50: >3.00E+4nM. Assay description: Inhibition of human CD38 extracellular domain expressed in Pichia pastoris using CHAPS and NAD by colorimetric-based assay
In DepthDetails ArticlePubMed