BDBM50111152 CHEMBL3604741
SMILES Cc1cc(NCc2ncccc2C(F)(F)F)c2cccc(C(N)=O)c2n1
InChI Key InChIKey=PMZBBAAKFFFMEV-UHFFFAOYSA-N
Data  1 IC50
  Tab Delimited (TSV)   2D SDfile   Computed 3D by Vconf -m prep SDfile
Find this compound or compounds like it in BindingDB:
Activity Spreadsheet -- Enzyme Inhibition Constant Data from BindingDB
Found 1 hit for monomerid = 50111152
TargetADP-ribosyl cyclase/cyclic ADP-ribose hydrolase 1(Homo sapiens (Human))
Glaxosmithkline
Curated by ChEMBL
LigandPNGBDBM50111152(CHEMBL3604741)
Affinity DataIC50:  8.50E+3nM. Assay description: Inhibition of human CD38 extracellular domain expressed in Pichia pastoris using CHAPS and NAD by colorimetric-based assay
In DepthDetails ArticlePubMed