BDBM50111155 CHEMBL269689::N-{3-[(Naphthalen-2-ylmethyl)-amino]-propyl}-guanidine
SMILES NC(=N)NCCCNCc1ccc2ccccc2c1
InChI Key InChIKey=LKKYDDAHTSVNFP-UHFFFAOYSA-N
Data  4 KI
  Tab Delimited (TSV)   2D SDfile   Computed 3D by Vconf -m prep SDfile
Find this compound or compounds like it in BindingDB:
Activity Spreadsheet -- Enzyme Inhibition Constant Data from BindingDB
Found 4 hits for monomerid = 50111155
TargetMelanocyte-stimulating hormone receptor(Homo sapiens (Human))
Uppsala University
Curated by ChEMBL
LigandPNGBDBM50111155(CHEMBL269689 | N-{3-[(Naphthalen-2-ylmethyl)-amino...)
Affinity DataKi:  1.90E+4nM. Assay description: Tested for its binding affinity towards human recombinant Melanocortin 1 receptor by using radioligand binding assay
In DepthDetails ArticlePubMed
TargetMelanocortin receptor 3(Homo sapiens (Human))
Uppsala University
Curated by ChEMBL
LigandPNGBDBM50111155(CHEMBL269689 | N-{3-[(Naphthalen-2-ylmethyl)-amino...)
Affinity DataKi:  3.10E+4nM. Assay description: Tested for its binding affinity towards human recombinant Melanocortin 3 receptor by using radioligand binding assay
In DepthDetails ArticlePubMed
TargetMelanocortin receptor 5(Homo sapiens (Human))
Uppsala University
Curated by ChEMBL
LigandPNGBDBM50111155(CHEMBL269689 | N-{3-[(Naphthalen-2-ylmethyl)-amino...)
Affinity DataKi:  3.60E+4nM. Assay description: Tested for its binding affinity towards human recombinant Melanocortin 5 receptor by using radioligand binding assay
In DepthDetails ArticlePubMed
TargetMelanocortin receptor 4(Homo sapiens (Human))
Uppsala University
Curated by ChEMBL
LigandPNGBDBM50111155(CHEMBL269689 | N-{3-[(Naphthalen-2-ylmethyl)-amino...)
Affinity DataKi:  5.60E+4nM. Assay description: Tested for its binding affinity towards human recombinant Melanocortin 4 receptor by using radioligand binding assay
In DepthDetails ArticlePubMed