BDBM50111241 (S)-3-{4-[(3,5-Dichloro-pyridine-4-carbonyl)-amino]-phenyl}-2-[2-(methyl-propyl-amino)-3,4-dioxo-cyclobut-1-enylamino]-propionic acid::CHEMBL9855
SMILES CCCN(C)c1c(N[C@@H](Cc2ccc(NC(=O)c3c(Cl)cncc3Cl)cc2)C(O)=O)c(=O)c1=O
InChI Key InChIKey=OSNQUPAEVQKVCT-INIZCTEOSA-N
Data  2 IC50
  Tab Delimited (TSV)   2D SDfile   Computed 3D by Vconf -m prep SDfile
Find this compound or compounds like it in BindingDB:
Activity Spreadsheet -- Enzyme Inhibition Constant Data from BindingDB
Found 2 hits for monomerid = 50111241
TargetIntegrin alpha-4/beta-1(Homo sapiens (Human))
Celltech R&D
Curated by ChEMBL
LigandPNGBDBM50111241((S)-3-{4-[(3,5-Dichloro-pyridine-4-carbonyl)-amino...)
Affinity DataIC50:  13nM. Assay description: Inhibition of binding of Very late antigen 4/vascular cell adhesion molecule 1 in a cell based ligand binding assay (Jurkat cells)
In DepthDetails ArticlePubMed
TargetIntegrin alpha-4/beta-1(Homo sapiens (Human))
Celltech R&D
Curated by ChEMBL
LigandPNGBDBM50111241((S)-3-{4-[(3,5-Dichloro-pyridine-4-carbonyl)-amino...)
Affinity DataIC50:  0.200nM. Assay description: Inhibition of binding of Very late antigen 4/vascular cell adhesion molecule 1 in a protein-based ligand binding assay
In DepthDetails ArticlePubMed