BDBM50111644 1-[2-(5-Chloro-2-oxo-benzothiazol-3-yl)-acetyl]-piperidine-4-carboxylic acid (3-acetyl-phenyl)-amide::CHEMBL17327
SMILES CC(=O)c1cccc(NC(=O)C2CCN(CC2)C(=O)Cn2c3cc(Cl)ccc3sc2=O)c1
InChI Key InChIKey=LNGLXMMBHKJCTE-UHFFFAOYSA-N
Data  2 IC50
  Tab Delimited (TSV)   2D SDfile   Computed 3D by Vconf -m prep SDfile
Find this compound or compounds like it in BindingDB:
Activity Spreadsheet -- Enzyme Inhibition Constant Data from BindingDB
Found 2 hits for monomerid = 50111644
TargetNeuropeptide Y receptor type 5(Homo sapiens (Human))
Fujisawa Pharmaceutical
Curated by ChEMBL
LigandPNGBDBM50111644(1-[2-(5-Chloro-2-oxo-benzothiazol-3-yl)-acetyl]-pi...)
Affinity DataIC50:  0.590nM. Assay description: Inhibitory concentration of total specific binding of [125I]- -PYY to HEK 293 cells transfected with the Human NPY-Y5 cDNA (compound prepared by para...
In DepthDetails ArticlePubMed
TargetNeuropeptide Y receptor type 5(Homo sapiens (Human))
Fujisawa Pharmaceutical
Curated by ChEMBL
LigandPNGBDBM50111644(1-[2-(5-Chloro-2-oxo-benzothiazol-3-yl)-acetyl]-pi...)
Affinity DataIC50:  2nM. Assay description: Inhibitory concentration of total specific binding of [125I]- -PYY to HEK 293 cells transfected with the Human NPY-Y5 cDNA (compound prepared by para...
In DepthDetails ArticlePubMed