BDBM50111769 CHEMBL3605354
SMILES C(CCCn1c2ccccc2c2cnccc12)CCCn1c2ccccc2c2cnccc12
InChI Key InChIKey=ZXHQVBQBXYWKAB-VXAIIWMZSA-N
Data  4 IC50
  Tab Delimited (TSV)   2D SDfile   Computed 3D by Vconf -m prep SDfile
Find this compound or compounds like it in BindingDB:
Activity Spreadsheet -- Enzyme Inhibition Constant Data from BindingDB
Found 4 hits for monomerid = 50111769
TargetAmine oxidase [flavin-containing] A(Homo sapiens (Human))
University Of Jena
Curated by ChEMBL
LigandPNGBDBM50111769(CHEMBL3605354)
Affinity DataIC50:  1.50E+3nM. Assay description: Inhibition of human recombinant MAOA
In DepthDetails ArticlePubMed
TargetAcetylcholinesterase(Electrophorus electricus (Electric eel))
University Of Jena
Curated by ChEMBL
LigandPNGBDBM50111769(CHEMBL3605354)
Affinity DataIC50:  89nM. Assay description: Inhibition of electric eel AChE using acetylthiocholine iodide substrate by Ellman assay
In DepthDetails ArticlePubMed
TargetCholinesterase(Equus caballus (Horse))
University Of Jena
Curated by ChEMBL
LigandPNGBDBM50111769(CHEMBL3605354)
Affinity DataIC50:  16nM. Assay description: Inhibition of BChE in equine serum using butyrylthiocholine iodide substrate by Ellman assay
In DepthDetails ArticlePubMed
TargetAmine oxidase [flavin-containing] B(Homo sapiens (Human))
University Of Jena
Curated by ChEMBL
LigandPNGBDBM50111769(CHEMBL3605354)
Affinity DataIC50:  1.60E+3nM. Assay description: Inhibition of human recombinant MAOB
In DepthDetails ArticlePubMed