BDBM50111831 (R)-2-[(7-Allyloxy-naphthalen-2-ylmethyl)-(4-methoxy-benzenesulfonyl)-amino]-N-hydroxy-propionamide::CHEMBL281165
SMILES COc1ccc(cc1)S(=O)(=O)N(Cc1ccc2ccc(OCC=C)cc2c1)[C@H](C)C(=O)NO
InChI Key InChIKey=HFSQWNYPWKHICG-QGZVFWFLSA-N
Data  1 IC50
  Tab Delimited (TSV)   2D SDfile   Computed 3D by Vconf -m prep SDfile
Find this compound or compounds like it in BindingDB:
Activity Spreadsheet -- Enzyme Inhibition Constant Data from BindingDB
Found 1 hit for monomerid = 50111831
TargetBone morphogenetic protein 1(Homo sapiens (Human))
Roche Bioscience
Curated by ChEMBL
LigandPNGBDBM50111831((R)-2-[(7-Allyloxy-naphthalen-2-ylmethyl)-(4-metho...)
Affinity DataIC50:  130nM. Assay description: Inhibitory activity against Procollagen C-Proteinase (PCP)
In DepthDetails ArticlePubMed