BDBM50112025 (3,5-Dichloro-phenyl)-carbamic acid 4-(1H-imidazol-4-ylmethyl)-benzyl ester::CHEMBL422721
SMILES Clc1cc(Cl)cc(NC(=O)OCc2ccc(Cc3cnc[nH]3)cc2)c1
InChI Key InChIKey=ZKLBGTZDKMEPTO-UHFFFAOYSA-N
Data  1 KI
  Tab Delimited (TSV)   2D SDfile   Computed 3D by Vconf -m prep SDfile
Find this compound or compounds like it in BindingDB:
Activity Spreadsheet -- Enzyme Inhibition Constant Data from BindingDB
Found 1 hit for monomerid = 50112025
TargetHistamine H3 receptor(GUINEA PIG)
The Schering Plough Research Institute
Curated by ChEMBL
LigandPNGBDBM50112025((3,5-Dichloro-phenyl)-carbamic acid 4-(1H-imidazol...)
Affinity DataKi:  5nM. Assay description: Compound was evaluated for its binding affinity against Histamine H3 receptor of guinea pig brain membrane
In DepthDetails ArticlePubMed