BDBM50112136 CHEMBL3609864::US9464044, 39
SMILES NC(=O)C12CC3CC(C1)[C@H](NC(=O)C1(CC1)NS(=O)(=O)c1ccccc1F)C(C3)C2
InChI Key InChIKey=CGPSAYFSIYKTQP-UVBRCKCBSA-N
Data  3 IC50
  Tab Delimited (TSV)   2D SDfile   Computed 3D by Vconf -m prep SDfile
Find this compound or compounds like it in BindingDB:
Activity Spreadsheet -- Enzyme Inhibition Constant Data from BindingDB
Found 3 hits for monomerid = 50112136
Target11-beta-hydroxysteroid dehydrogenase 1(Homo sapiens (Human))
Ahn-Gook Pharmaceutical
US Patent
LigandPNGBDBM50112136(CHEMBL3609864 | US9464044, 39)
Affinity DataIC50:  24.7nMpH: 6.0 T: 2°C. Assay description: The inhibiting activity of 11β-HSD1 derived from microsomal fractions was measured using the HTRF assay (62CO2PEB, Cisbio). Different concentrat...
In DepthDetails US Patent
Target11-beta-hydroxysteroid dehydrogenase 1(Mus musculus (mouse))
Incheon National University
Curated by ChEMBL
LigandPNGBDBM50112136(CHEMBL3609864 | US9464044, 39)
Affinity DataIC50:  193nM. Assay description: Inhibition of mouse 11beta-HSD1
In DepthDetails ArticlePubMed
Target11-beta-hydroxysteroid dehydrogenase 1(Homo sapiens (Human))
Ahn-Gook Pharmaceutical
US Patent
LigandPNGBDBM50112136(CHEMBL3609864 | US9464044, 39)
Affinity DataIC50:  25nM. Assay description: Inhibition of human 11beta-HSD1
In DepthDetails ArticlePubMed