BDBM50112146 CHEMBL3609874
SMILES CC(C)(NS(=O)(=O)c1ccc(O)cc1)C(=O)N[C@H]1C2CC3CC1CC(C3)(C2)C(N)=O
InChI Key InChIKey=HBEAIRAUSWQMSP-ZWRMXLCRSA-N
Data  2 IC50
  Tab Delimited (TSV)   2D SDfile   Computed 3D by Vconf -m prep SDfile
Find this compound or compounds like it in BindingDB:
Activity Spreadsheet -- Enzyme Inhibition Constant Data from BindingDB
Found 2 hits for monomerid = 50112146
Target11-beta-hydroxysteroid dehydrogenase 1(Mus musculus (mouse))
Incheon National University
Curated by ChEMBL
LigandPNGBDBM50112146(CHEMBL3609874)
Affinity DataIC50:  84nM. Assay description: Inhibition of mouse 11beta-HSD1
In DepthDetails ArticlePubMed
Target11-beta-hydroxysteroid dehydrogenase 1(Homo sapiens (Human))
Incheon National University
Curated by ChEMBL
LigandPNGBDBM50112146(CHEMBL3609874)
Affinity DataIC50:  44nM. Assay description: Inhibition of human 11beta-HSD1
In DepthDetails ArticlePubMed