BDBM50112150 CHEMBL3608399
SMILES CC(C)(NS(=O)(=O)c1cc(F)c(F)cc1F)C(=O)N[C@H]1C2CC3CC1CC(C3)(C2)C(N)=O
InChI Key InChIKey=CACKWZSWZJRLFN-HKDHMIFRSA-N
Data  2 IC50
  Tab Delimited (TSV)   2D SDfile   Computed 3D by Vconf -m prep SDfile
Find this compound or compounds like it in BindingDB:
Activity Spreadsheet -- Enzyme Inhibition Constant Data from BindingDB
Found 2 hits for monomerid = 50112150
Target11-beta-hydroxysteroid dehydrogenase 1(Mus musculus (mouse))
Incheon National University
Curated by ChEMBL
LigandPNGBDBM50112150(CHEMBL3608399)
Affinity DataIC50:  207nM. Assay description: Inhibition of mouse 11beta-HSD1
In DepthDetails ArticlePubMed
Target11-beta-hydroxysteroid dehydrogenase 1(Homo sapiens (Human))
Incheon National University
Curated by ChEMBL
LigandPNGBDBM50112150(CHEMBL3608399)
Affinity DataIC50:  14nM. Assay description: Inhibition of human 11beta-HSD1
In DepthDetails ArticlePubMed