BDBM50112175 CHEMBL3608431
SMILES CN1CCN(CC1)c1ccc(Nc2nc(nc3n(CCO)cnc23)N2CC[C@@H](C2)NC(=O)C=C)cc1
InChI Key InChIKey=WEUCCQODBSFSNN-IBGZPJMESA-N
Data  1 IC50
  Tab Delimited (TSV)   2D SDfile   Computed 3D by Vconf -m prep SDfile
Find this compound or compounds like it in BindingDB:
Activity Spreadsheet -- Enzyme Inhibition Constant Data from BindingDB
Found 1 hit for monomerid = 50112175
TargetEpidermal growth factor receptor(Homo sapiens (Human))
Therachem Research Medilab (India)
Curated by ChEMBL
LigandPNGBDBM50112175(CHEMBL3608431)
Affinity DataIC50:  4.19E+3nM. Assay description: Inhibition of wild type EGFR in human A549 cells assessed as inhibition of phosphorylation at Y1068 after 2 hrs by sandwich ELISA method
In DepthDetails ArticlePubMed