BDBM50112185 CHEMBL416117::N-[5-(6-Cyclopentylamino-purin-9-yl)-4-hydroxy-2-methyl-tetrahydro-furan-3-yl]-4-isopropyl-benzamide
SMILES CC(C)c1ccc(cc1)C(=O)N[C@H]1[C@@H](C)O[C@H]([C@@H]1O)n1cnc2c(NC3CCCC3)ncnc12
InChI Key InChIKey=VFWUBMBJELPDPS-QZQLUZMSSA-N
Data  1 KI
  Tab Delimited (TSV)   2D SDfile   Computed 3D by Vconf -m prep SDfile
Find this compound or compounds like it in BindingDB:
Activity Spreadsheet -- Enzyme Inhibition Constant Data from BindingDB
Found 1 hit for monomerid = 50112185
TargetAdenosine receptor A1(Rattus norvegicus (rat))
Ghent University
Curated by ChEMBL
LigandPNGBDBM50112185(CHEMBL416117 | N-[5-(6-Cyclopentylamino-purin-9-yl...)
Affinity DataKi:  270nM. Assay description: Binding affinity at rat Adenosine A1 receptor in the absence of GTP
In DepthDetails ArticlePubMed