BDBM50112366 CHEMBL3609408
SMILES CS(=O)(=O)c1ccc(CC(=O)Nc2cc(Cl)c(c(Cl)c2)-c2ccccc2OC(F)(F)F)cc1
InChI Key InChIKey=AKJULTWNHWSAFM-UHFFFAOYSA-N
Data  3 IC50
  Tab Delimited (TSV)   2D SDfile   Computed 3D by Vconf -m prep SDfile
Find this compound or compounds like it in BindingDB:
Activity Spreadsheet -- Enzyme Inhibition Constant Data from BindingDB
Found 3 hits for monomerid = 50112366
TargetNuclear receptor ROR-gamma(Homo sapiens (Human))
Fudan University
Curated by ChEMBL
LigandPNGBDBM50112366(CHEMBL3609408)
Affinity DataIC50:  5nM. Assay description: Inhibition of RORgammat (unknown origin) assessed as inhibition of agonist-induced response by FRET assay
In DepthDetails ArticlePubMed
TargetNuclear receptor ROR-gamma(Homo sapiens (Human))
Fudan University
Curated by ChEMBL
LigandPNGBDBM50112366(CHEMBL3609408)
Affinity DataIC50:  10nM. Assay description: Inhibition of human APC-labeled RORgammat LBD (262 to 518 residues) transfected in Escherichia coli BL21 (DE3) assessed as biotinylated SRC recruitme...
In DepthDetails ArticlePubMed
TargetNuclear receptor ROR-gamma(Homo sapiens (Human))
Fudan University
Curated by ChEMBL
LigandPNGBDBM50112366(CHEMBL3609408)
Affinity DataIC50:  47nM. Assay description: Inhibition of human GAL4-fused RORgammat LBD transfected in HEK293T cell measured after 24 hrs by by dual-glo luciferase assay
In DepthDetails ArticlePubMed