BDBM50112368 CHEMBL3609406
SMILES CCS(=O)(=O)c1ccc(CC(=O)Nc2cc(C)c(c(Cl)c2)-c2ccccc2OC(F)(F)F)cc1
InChI Key InChIKey=WTWORGXHRHOEOZ-UHFFFAOYSA-N
Data  1 IC50
  Tab Delimited (TSV)   2D SDfile   Computed 3D by Vconf -m prep SDfile
Find this compound or compounds like it in BindingDB:
Activity Spreadsheet -- Enzyme Inhibition Constant Data from BindingDB
Found 1 hit for monomerid = 50112368
TargetNuclear receptor ROR-gamma(Homo sapiens (Human))
Fudan University
Curated by ChEMBL
LigandPNGBDBM50112368(CHEMBL3609406)
Affinity DataIC50:  4nM. Assay description: Inhibition of RORgammat (unknown origin) assessed as inhibition of agonist-induced response by FRET assay
In DepthDetails ArticlePubMed