BDBM50112404 CHEMBL23067::Sulfamic acid 2,2,2-trichloro-ethyl ester
SMILES NS(=O)(=O)OCC(Cl)(Cl)Cl
InChI Key InChIKey=VOKONKGVTXWZJI-UHFFFAOYSA-N
Data  1 IC50
  Tab Delimited (TSV)   2D SDfile   Computed 3D by Vconf -m prep SDfile
Find this compound or compounds like it in BindingDB:
Activity Spreadsheet -- Enzyme Inhibition Constant Data from BindingDB
Found 1 hit for monomerid = 50112404
TargetSteryl-sulfatase(Homo sapiens (Human))
Kingston University
Curated by ChEMBL
LigandPNGBDBM50112404(CHEMBL23067 | Sulfamic acid 2,2,2-trichloro-ethyl ...)
Affinity DataIC50:  7.50E+5nM. Assay description: In vitro inhibition of estrone sulfatase.
In DepthDetails ArticlePubMed