BDBM50112489 CHEMBL277424::N-[3-(5-Carbamimidoyl-2-hydroxy-phenyl)-allyl]-N-[4-(1-methyl-piperidin-4-yloxy)-3-trifluoromethyl-phenyl]-succinamic acid
SMILES CN1CCC(CC1)Oc1ccc(cc1C(F)(F)F)N(C\C=C\c1cc(ccc1O)C(N)=N)C(=O)CCC(O)=O
InChI Key InChIKey=NKSLZFJLSABSEY-NSCUHMNNSA-N
Data  3 KI
  Tab Delimited (TSV)   2D SDfile   Computed 3D by Vconf -m prep SDfile
Find this compound or compounds like it in BindingDB:
Activity Spreadsheet -- Enzyme Inhibition Constant Data from BindingDB
Found 3 hits for monomerid = 50112489
TargetCoagulation factor X(Homo sapiens (Human))
Berlex Biosciences
Curated by ChEMBL
LigandPNGBDBM50112489(CHEMBL277424 | N-[3-(5-Carbamimidoyl-2-hydroxy-phe...)
Affinity DataKi:  0.280nM. Assay description: Competitive inhibition of coagulation factor Xa
In DepthDetails ArticlePubMed
TargetSerine protease 1(Bos taurus (bovine))
Berlex Biosciences
Curated by ChEMBL
LigandPNGBDBM50112489(CHEMBL277424 | N-[3-(5-Carbamimidoyl-2-hydroxy-phe...)
Affinity DataKi:  765nM. Assay description: Competitive inhibition of trypsin
In DepthDetails ArticlePubMed
TargetProthrombin(Homo sapiens (Human))
Berlex Biosciences
Curated by ChEMBL
LigandPNGBDBM50112489(CHEMBL277424 | N-[3-(5-Carbamimidoyl-2-hydroxy-phe...)
Affinity DataKi: >5.00E+3nM. Assay description: Competitive inhibition of coagulation factor IIa
In DepthDetails ArticlePubMed