BDBM50112492 CHEMBL26287::N-[3-(3-Carbamimidoyl-phenyl)-allyl]-N-{4-[1-(1-imino-ethyl)-piperidin-4-yloxy]-3-trifluoromethyl-phenyl}-succinamic acid ethyl ester
SMILES CCOC(=O)CCC(=O)N(C\C=C\c1cccc(c1)C(N)=N)c1ccc(OC2CCN(CC2)C(C)=N)c(c1)C(F)(F)F
InChI Key InChIKey=JGKDGRZVRGTIIF-OQASYWHQSA-N
Data  3 KI
  Tab Delimited (TSV)   2D SDfile   Computed 3D by Vconf -m prep SDfile
Find this compound or compounds like it in BindingDB:
Activity Spreadsheet -- Enzyme Inhibition Constant Data from BindingDB
Found 3 hits for monomerid = 50112492
TargetCoagulation factor X(Homo sapiens (Human))
Berlex Biosciences
Curated by ChEMBL
LigandPNGBDBM50112492(CHEMBL26287 | N-[3-(3-Carbamimidoyl-phenyl)-allyl]...)
Affinity DataKi:  0.550nM. Assay description: Competitive inhibition of coagulation factor Xa
In DepthDetails ArticlePubMed
TargetSerine protease 1(Bos taurus (bovine))
Berlex Biosciences
Curated by ChEMBL
LigandPNGBDBM50112492(CHEMBL26287 | N-[3-(3-Carbamimidoyl-phenyl)-allyl]...)
Affinity DataKi:  76nM. Assay description: Competitive inhibition of trypsin
In DepthDetails ArticlePubMed
TargetProthrombin(Homo sapiens (Human))
Berlex Biosciences
Curated by ChEMBL
LigandPNGBDBM50112492(CHEMBL26287 | N-[3-(3-Carbamimidoyl-phenyl)-allyl]...)
Affinity DataKi:  1.00E+3nM. Assay description: Competitive inhibition of coagulation factor IIa
In DepthDetails ArticlePubMed