BDBM50112500 3'-({4-[1-(1-Imino-ethyl)-piperidin-4-yloxy]-3-nitro-phenylamino}-methyl)-biphenyl-3-carboxamidine::CHEMBL25461
SMILES CC([NH-])=[N+]1CCC(CC1)Oc1ccc(NCc2cccc(c2)-c2cccc(c2)C(N)=N)cc1[N+]([O-])=O
InChI Key InChIKey=XZUDLMLPCQEKES-UHFFFAOYSA-N
Data  3 KI
  Tab Delimited (TSV)   2D SDfile   Computed 3D by Vconf -m prep SDfile
Find this compound or compounds like it in BindingDB:
Activity Spreadsheet -- Enzyme Inhibition Constant Data from BindingDB
Found 3 hits for monomerid = 50112500
TargetCoagulation factor X(Homo sapiens (Human))
Berlex Biosciences
Curated by ChEMBL
LigandPNGBDBM50112500(3'-({4-[1-(1-Imino-ethyl)-piperidin-4-yloxy]-3-nit...)
Affinity DataKi:  0.170nM. Assay description: Competitive inhibition of coagulation factor Xa
In DepthDetails ArticlePubMed
TargetSerine protease 1(Bos taurus (bovine))
Berlex Biosciences
Curated by ChEMBL
LigandPNGBDBM50112500(3'-({4-[1-(1-Imino-ethyl)-piperidin-4-yloxy]-3-nit...)
Affinity DataKi:  42nM. Assay description: Competitive inhibition of trypsin
In DepthDetails ArticlePubMed
TargetProthrombin(Homo sapiens (Human))
Berlex Biosciences
Curated by ChEMBL
LigandPNGBDBM50112500(3'-({4-[1-(1-Imino-ethyl)-piperidin-4-yloxy]-3-nit...)
Affinity DataKi:  400nM. Assay description: Competitive inhibition of coagulation factor IIa
In DepthDetails ArticlePubMed