BDBM50112501 4-{4-[3-(5-Carbamimidoyl-2-hydroxy-phenyl)-allylamino]-2-trifluoromethyl-phenoxy}-piperidine-1-carboxylic acid amide::CHEMBL24433
SMILES NC(=N)c1ccc(O)c(C=CCNc2ccc(OC3CCN(CC3)C(N)=O)c(c2)C(F)(F)F)c1
InChI Key InChIKey=GLBXBDIEHKDXLC-UHFFFAOYSA-N
Data  3 KI
  Tab Delimited (TSV)   2D SDfile   Computed 3D by Vconf -m prep SDfile
Find this compound or compounds like it in BindingDB:
Activity Spreadsheet -- Enzyme Inhibition Constant Data from BindingDB
Found 3 hits for monomerid = 50112501
TargetCoagulation factor X(Homo sapiens (Human))
Berlex Biosciences
Curated by ChEMBL
LigandPNGBDBM50112501(4-{4-[3-(5-Carbamimidoyl-2-hydroxy-phenyl)-allylam...)
Affinity DataKi:  7.30nM. Assay description: Competitive inhibition of coagulation factor Xa
In DepthDetails ArticlePubMed
TargetProthrombin(Homo sapiens (Human))
Berlex Biosciences
Curated by ChEMBL
LigandPNGBDBM50112501(4-{4-[3-(5-Carbamimidoyl-2-hydroxy-phenyl)-allylam...)
Affinity DataKi:  250nM. Assay description: Competitive inhibition of coagulation factor IIa
In DepthDetails ArticlePubMed
TargetSerine protease 1(Bos taurus (bovine))
Berlex Biosciences
Curated by ChEMBL
LigandPNGBDBM50112501(4-{4-[3-(5-Carbamimidoyl-2-hydroxy-phenyl)-allylam...)
Affinity DataKi:  520nM. Assay description: Competitive inhibition of trypsin
In DepthDetails ArticlePubMed