BDBM50112535 2-[1-(4-Chloro-benzoyl)-5-methoxy-2-methyl-1H-indol-3-yl]-N-(1-hydroxymethyl-2-methyl-butyl)-acetamide::CHEMBL24798
SMILES CCC(C)[C@@H](CO)NC(=O)Cc1c(C)n(C(=O)c2ccc(Cl)cc2)c2ccc(OC)cc12
InChI Key InChIKey=UTFHAGDGYYWINF-ZZAPORBBSA-N
Data  2 IC50
  Tab Delimited (TSV)   2D SDfile   Computed 3D by Vconf -m prep SDfile
Find this compound or compounds like it in BindingDB:
Activity Spreadsheet -- Enzyme Inhibition Constant Data from BindingDB
Found 2 hits for monomerid = 50112535
TargetProstaglandin G/H synthase 2(Homo sapiens (Human))
Vanderbilt University School Of Medicine
Curated by ChEMBL
LigandPNGBDBM50112535(2-[1-(4-Chloro-benzoyl)-5-methoxy-2-methyl-1H-indo...)
Affinity DataIC50:  110nM. Assay description: Inhibitory concentration against human prostaglandin G/H synthase 2
In DepthDetails ArticlePubMed
TargetProstaglandin G/H synthase 1(Ovis aries (Sheep))
Vanderbilt University School Of Medicine
Curated by ChEMBL
LigandPNGBDBM50112535(2-[1-(4-Chloro-benzoyl)-5-methoxy-2-methyl-1H-indo...)
Affinity DataIC50:  480nM. Assay description: Inhibitory concentration against prostaglandin G/H synthase 1
In DepthDetails ArticlePubMed