BDBM50112577 2-[3-(6-Ethyl-8-iodo-1,2,3,4-tetrahydro-quinolin-4-ylamino)-propylamino]-1H-quinolin-4-one::CHEMBL58615
SMILES CCc1cc(I)c2NCCC(NCCCNc3cc(O)c4ccccc4n3)c2c1
InChI Key InChIKey=HXYAFIKGAHUOHV-UHFFFAOYSA-N
Data  2 IC50
  Tab Delimited (TSV)   2D SDfile   Computed 3D by Vconf -m prep SDfile
Find this compound or compounds like it in BindingDB:
Activity Spreadsheet -- Enzyme Inhibition Constant Data from BindingDB
Found 2 hits for monomerid = 50112577
TargetMethionine--tRNA ligase(Escherichia coli (strain K12))
Glaxosmithkline
Curated by ChEMBL
LigandPNGBDBM50112577(2-[3-(6-Ethyl-8-iodo-1,2,3,4-tetrahydro-quinolin-4...)
Affinity DataIC50:  12nM. Assay description: Compound tested for inhibition of Staphylococcus aureus MRS (methionyl tRNA synthetase) in aminoacylation assay
In DepthDetails ArticlePubMed
TargetMethionine--tRNA ligase, cytoplasmic(Homo sapiens (Human))
TBA
Curated by ChEMBL
LigandPNGBDBM50112577(2-[3-(6-Ethyl-8-iodo-1,2,3,4-tetrahydro-quinolin-4...)
Affinity DataIC50:  12nM. Assay description: In vitro inhibitory concentration against Staphylococcus aureus Methionyl-tRNA synthetase
In DepthDetails ArticlePubMed