BDBM50112785 1-{4-[3-(2,4-Dimethoxy-phenyl)-isoxazol-5-yl]-butyl}-4-(2-methoxy-phenyl)-piperazine; hydrochloride::CHEMBL543278
SMILES COc1ccc(-c2cc(CCCCN3CCN(CC3)c3ccccc3OC)on2)c(OC)c1
InChI Key InChIKey=GNYOQFHOPOYCQH-UHFFFAOYSA-N
Data  3 KI
  Tab Delimited (TSV)   2D SDfile   Computed 3D by Vconf -m prep SDfile
Find this compound or compounds like it in BindingDB:
Activity Spreadsheet -- Enzyme Inhibition Constant Data from BindingDB
Found 3 hits for monomerid = 50112785
TargetD(3) dopamine receptor(Homo sapiens (Human))
Institute Of Science And Technology
Curated by ChEMBL
LigandPNGBDBM50112785(1-{4-[3-(2,4-Dimethoxy-phenyl)-isoxazol-5-yl]-buty...)
Affinity DataKi:  6.5nM. Assay description: Displacement of the radioligand [3H]YM-09151-2 from cloned human Dopamine receptor D3 expressed in CHO cells
In DepthDetails ArticlePubMed
TargetD(4) dopamine receptor(Homo sapiens (Human))
Institute Of Science And Technology
Curated by ChEMBL
LigandPNGBDBM50112785(1-{4-[3-(2,4-Dimethoxy-phenyl)-isoxazol-5-yl]-buty...)
Affinity DataKi:  34nM. Assay description: Displacement of the radioligand [3H]spiperone from the cloned human dopamine receptor D4 expressed in CHO cells
In DepthDetails ArticlePubMed
TargetD(2) dopamine receptor(Homo sapiens (Human))
Institute Of Science And Technology
Curated by ChEMBL
LigandPNGBDBM50112785(1-{4-[3-(2,4-Dimethoxy-phenyl)-isoxazol-5-yl]-buty...)
Affinity DataKi:  440nM. Assay description: Displacement of the radioligand [3H]spiperone from the cloned human Dopamine receptor D2 long expressed in CHO cells
In DepthDetails ArticlePubMed