BDBM50112801 1-Benzhydryl-4-{4-[3-(3,4-dimethoxy-phenyl)-isoxazol-5-yl]-butyl}-piperazine; hydrochloride::CHEMBL542571
SMILES COc1ccc(cc1OC)-c1cc(CCCCN2CCN(CC2)C(c2ccccc2)c2ccccc2)on1
InChI Key InChIKey=RRGIAVYUCTYDDX-UHFFFAOYSA-N
Data  3 KI
  Tab Delimited (TSV)   2D SDfile   Computed 3D by Vconf -m prep SDfile
Find this compound or compounds like it in BindingDB:
Activity Spreadsheet -- Enzyme Inhibition Constant Data from BindingDB
Found 3 hits for monomerid = 50112801
TargetD(3) dopamine receptor(Homo sapiens (Human))
Institute Of Science And Technology
Curated by ChEMBL
LigandPNGBDBM50112801(1-Benzhydryl-4-{4-[3-(3,4-dimethoxy-phenyl)-isoxaz...)
Affinity DataKi:  20nM. Assay description: Displacement of the radioligand [3H]YM-09151-2 from cloned human Dopamine receptor D3 expressed in CHO cells
In DepthDetails ArticlePubMed
TargetD(4) dopamine receptor(Homo sapiens (Human))
Institute Of Science And Technology
Curated by ChEMBL
LigandPNGBDBM50112801(1-Benzhydryl-4-{4-[3-(3,4-dimethoxy-phenyl)-isoxaz...)
Affinity DataKi:  2.44E+3nM. Assay description: Displacement of the radioligand [3H]spiperone from the cloned human dopamine receptor D4 expressed in CHO cells
In DepthDetails ArticlePubMed
TargetD(2) dopamine receptor(Homo sapiens (Human))
Institute Of Science And Technology
Curated by ChEMBL
LigandPNGBDBM50112801(1-Benzhydryl-4-{4-[3-(3,4-dimethoxy-phenyl)-isoxaz...)
Affinity DataKi:  2.62E+3nM. Assay description: Displacement of the radioligand [3H]spiperone from the cloned human Dopamine receptor D2 long expressed in CHO cells
In DepthDetails ArticlePubMed