BDBM50112834 CHEMBL27250::N-(1-Benzyl-2-oxo-ethyl)-2-phenylethynyl-benzamide
SMILES O=CC(Cc1ccccc1)NC(=O)c1ccccc1C#Cc1ccccc1
InChI Key InChIKey=GAKMLZIIDRDDBP-UHFFFAOYSA-N
Data  1 KI
  Tab Delimited (TSV)   2D SDfile   Computed 3D by Vconf -m prep SDfile
Find this compound or compounds like it in BindingDB:
Activity Spreadsheet -- Enzyme Inhibition Constant Data from BindingDB
Found 1 hit for monomerid = 50112834
TargetCalpain-1 catalytic subunit(Homo sapiens (Human))
Abbott
Curated by ChEMBL
LigandPNGBDBM50112834(CHEMBL27250 | N-(1-Benzyl-2-oxo-ethyl)-2-phenyleth...)
Affinity DataKi:  450nM. Assay description: Inhibition of calpain, using human mu-calpain isolated from erythrocytes and Suc-Leu-Tyr-AMC as the fluorogenic substrate
In DepthDetails ArticlePubMed