BDBM50112845 CHEMBL280654::N-(1-Benzyl-2-oxo-ethyl)-2-(2-naphthalen-2-yl-vinyl)-benzamide
SMILES O=CC(Cc1ccccc1)NC(=O)c1ccccc1\C=C\c1ccc2ccccc2c1
InChI Key InChIKey=VLXHBDQPEQIUPU-BMRADRMJSA-N
Data  1 KI
  Tab Delimited (TSV)   2D SDfile   Computed 3D by Vconf -m prep SDfile
Find this compound or compounds like it in BindingDB:
Activity Spreadsheet -- Enzyme Inhibition Constant Data from BindingDB
Found 1 hit for monomerid = 50112845
TargetCalpain-1 catalytic subunit(Homo sapiens (Human))
Abbott
Curated by ChEMBL
LigandPNGBDBM50112845(CHEMBL280654 | N-(1-Benzyl-2-oxo-ethyl)-2-(2-napht...)
Affinity DataKi:  15nM. Assay description: Inhibition of calpain, using human mu-calpain isolated from erythrocytes and Suc-Leu-Tyr-AMC as the fluorogenic substrate
In DepthDetails ArticlePubMed