BDBM50112892 CHEMBL3600835
SMILES CCCC[C@@H](NC(C)=O)C(=O)N[C@H]1CC(=O)NCCCC[C@H](NC(=O)[C@H](Cc2c[nH]c3ccccc23)NC(=O)[C@H](CCCNC(N)=N)NC(=O)[C@@H](Cc2ccc3ccccc3c2)NC(=O)[C@H](Cc2cnc[nH]2)N(C)C1=O)C(N)=O
InChI Key InChIKey=BBJOQSQVKOIBHK-PIHYJXJMSA-N
Data  4 IC50  4 EC50
  Tab Delimited (TSV)   2D SDfile   Computed 3D by Vconf -m prep SDfile
Find this compound or compounds like it in BindingDB:
Activity Spreadsheet -- Enzyme Inhibition Constant Data from BindingDB
Found 8 hits for monomerid = 50112892
TargetMelanocyte-stimulating hormone receptor(Homo sapiens (Human))
University Of Arizona
Curated by ChEMBL
LigandPNGBDBM50112892(CHEMBL3600835)
Affinity DataIC50:  106nM. Assay description: Displacement of [125I]-[Nle4,D-Phe7]-alpha-MSH from human MC1 receptor expressed in HEK293 cells after 40 mins by luminescence counting
In DepthDetails ArticlePubMed
TargetMelanocortin receptor 3(Homo sapiens (Human))
University Of Arizona
Curated by ChEMBL
LigandPNGBDBM50112892(CHEMBL3600835)
Affinity DataIC50:  3.20nM. Assay description: Displacement of [125I]-[Nle4,D-Phe7]-alpha-MSH from human MC3 receptor expressed in HEK293 cells after 40 mins by luminescence counting
In DepthDetails ArticlePubMed
TargetMelanocortin receptor 4(Homo sapiens (Human))
University Of Arizona
Curated by ChEMBL
LigandPNGBDBM50112892(CHEMBL3600835)
Affinity DataEC50: >1.00E+4nM. Assay description: Agonist activity at human MC4 receptor expressed in HEK293 cells assessed as intracellular cAMP accumulation using [3H]-cAMP by luminescence counting
In DepthDetails ArticlePubMed
TargetMelanocortin receptor 3(Homo sapiens (Human))
University Of Arizona
Curated by ChEMBL
LigandPNGBDBM50112892(CHEMBL3600835)
Affinity DataEC50: >1.00E+4nM. Assay description: Agonist activity at human MC3 receptor expressed in HEK293 cells assessed as intracellular cAMP accumulation using [3H]-cAMP by luminescence counting
In DepthDetails ArticlePubMed
TargetMelanocortin receptor 5(Homo sapiens (Human))
University Of Arizona
Curated by ChEMBL
LigandPNGBDBM50112892(CHEMBL3600835)
Affinity DataIC50:  5nM. Assay description: Displacement of [125I]-[Nle4,D-Phe7]-alpha-MSH from human MC5 receptor expressed in HEK293 cells after 40 mins by luminescence counting
In DepthDetails ArticlePubMed
TargetMelanocortin receptor 4(Homo sapiens (Human))
University Of Arizona
Curated by ChEMBL
LigandPNGBDBM50112892(CHEMBL3600835)
Affinity DataIC50:  66nM. Assay description: Displacement of [125I]-[Nle4,D-Phe7]-alpha-MSH from human MC4 receptor expressed in HEK293 cells after 40 mins by luminescence counting
In DepthDetails ArticlePubMed
TargetMelanocyte-stimulating hormone receptor(Homo sapiens (Human))
University Of Arizona
Curated by ChEMBL
LigandPNGBDBM50112892(CHEMBL3600835)
Affinity DataEC50:  115nM. Assay description: Agonist activity at human MC1 receptor expressed in HEK293 cells assessed as intracellular cAMP accumulation using [3H]-cAMP by luminescence counting
In DepthDetails ArticlePubMed
TargetMelanocortin receptor 5(Homo sapiens (Human))
University Of Arizona
Curated by ChEMBL
LigandPNGBDBM50112892(CHEMBL3600835)
Affinity DataEC50: >1.00E+4nM. Assay description: Agonist activity at human MC5 receptor expressed in HEK293 cells assessed as intracellular cAMP accumulation using [3H]-cAMP by luminescence counting
In DepthDetails ArticlePubMed