BDBM50113190 (1E)-N'-(2-chlorophenyl)-2-oxo-N-phenylpropanehydrazonamide::CHEMBL68238
SMILES CC(=O)C(Nc1ccccc1)=NNc1ccccc1Cl
InChI Key InChIKey=GRZCZRWDMNLIQD-UHFFFAOYSA-N
Data  1 KI
  Tab Delimited (TSV)   2D SDfile   Computed 3D by Vconf -m prep SDfile
Find this compound or compounds like it in BindingDB:
Activity Spreadsheet -- Enzyme Inhibition Constant Data from BindingDB
Found 1 hit for monomerid = 50113190
TargetCorticotropin-releasing factor receptor 1(Homo sapiens (Human))
TBA
Curated by ChEMBL
LigandPNGBDBM50113190((1E)-N'-(2-chlorophenyl)-2-oxo-N-phenylpropanehydr...)
Affinity DataKi:  299nM. Assay description: Binding affinity against human Corticotropin releasing factor receptor 1
In DepthDetails ArticlePubMed