BDBM50113349 CHEMBL457388
SMILES Fc1cccc(F)c1C(=O)Nc1c[nH]nc1C(=O)NC1CCNCC1
InChI Key InChIKey=CXBHMSHVCKEEGW-UHFFFAOYSA-N
Data  5 IC50
PDB links: 1 PDB ID matches this monomer.
  Tab Delimited (TSV)   2D SDfile   Computed 3D by Vconf -m prep SDfile
Find this compound or compounds like it in BindingDB:
Activity Spreadsheet -- Enzyme Inhibition Constant Data from BindingDB
Found 5 hits for monomerid = 50113349
LigandPNGBDBM50113349(CHEMBL457388)
Affinity DataIC50:  980nM. Assay description: Inhibition of CDK1/cyclin B (unknown origin) by radiometric filter binding assay
In DepthDetails ArticlePubMed
TargetCyclin-A1/Cyclin-A2/Cyclin-dependent kinase 2(Homo sapiens (Human))
Eli Lilly
Curated by ChEMBL
LigandPNGBDBM50113349(CHEMBL457388)
Affinity DataIC50:  140nM. Assay description: Inhibition of CDK2/cyclin A (unknown origin) by radiometric filter binding assay
TargetCyclin-A2/Cyclin-dependent kinase 2(Homo sapiens (Human))
Shanghaitech University
Curated by ChEMBL
LigandPNGBDBM50113349(CHEMBL457388)
Affinity DataIC50:  250nM. Assay description: Inhibition of CDK2/cyclin A2 (unknown origin) using FAM-labeled peptide and ATP as substrate preincubated for 10 mins followed by substrate addition ...
TargetCyclin-dependent kinase/G2/mitotic-specific cyclin- 1(Homo sapiens (Human))
Shanghaitech University
Curated by ChEMBL
LigandPNGBDBM50113349(CHEMBL457388)
Affinity DataIC50:  594nM. Assay description: Inhibition of CDK1/cyclin B1 (unknown origin) using FAM-labeled peptide and ATP as substrate preincubated for 10 mins followed by substrate addition ...
In DepthDetails ArticlePubMed
TargetCyclin-A2/Cyclin-dependent kinase 2(Homo sapiens (Human))
Shanghaitech University
Curated by ChEMBL
LigandPNGBDBM50113349(CHEMBL457388)
Affinity DataIC50:  140nM. Assay description: Inhibition of C-terminal His6-tagged human full length CDK2/N-terminal GST-tagged human full length Cyclin A using histone H1 and [gamma-32P]-ATP inc...