BDBM50113381 4-[(R)-1-(3-Cyclopentyloxy-4-methoxy-phenyl)-2-pyridin-4-yl-ethyl]-phenol::CHEMBL35391
SMILES COc1ccc(cc1OC1CCCC1)[C@H](Cc1ccncc1)c1ccc(O)cc1
InChI Key InChIKey=SECLCIMCGMWSOM-HSZRJFAPSA-N
Data  1 IC50
  Tab Delimited (TSV)   2D SDfile   Computed 3D by Vconf -m prep SDfile
Find this compound or compounds like it in BindingDB:
Activity Spreadsheet -- Enzyme Inhibition Constant Data from BindingDB
Found 1 hit for monomerid = 50113381
TargetcAMP-specific 3',5'-cyclic phosphodiesterase 4A(Homo sapiens (Human))
Celltech R&D
Curated by ChEMBL
LigandPNGBDBM50113381(4-[(R)-1-(3-Cyclopentyloxy-4-methoxy-phenyl)-2-pyr...)
Affinity DataIC50:  5nM. Assay description: Inhibition of human recombinant phosphodiesterase 4A
In DepthDetails ArticlePubMed