BDBM50113622 CHEMBL3604638
SMILES CC(C)S(=O)(=O)c1nn(C)cc1Nc1nc(Nc2cc(C)c(cc2OC(F)(F)F)C2CCN(C)CC2)ncc1Cl
InChI Key InChIKey=IFGGCOSWGWXXLV-UHFFFAOYSA-N
Data  2 IC50
  Tab Delimited (TSV)   2D SDfile   Computed 3D by Vconf -m prep SDfile
Find this compound or compounds like it in BindingDB:
Activity Spreadsheet -- Enzyme Inhibition Constant Data from BindingDB
Found 2 hits for monomerid = 50113622
TargetALK tyrosine kinase receptor(Homo sapiens (Human))
Beijing Pearl Biotech
Curated by ChEMBL
LigandPNGBDBM50113622(CHEMBL3604638)
Affinity DataIC50:  6nM. Assay description: Inhibition of wild type human recombinant ALK using TK substrate-biotin incubated for 30 mins by HTRF assay
In DepthDetails ArticlePubMed
TargetALK tyrosine kinase receptor(Homo sapiens (Human))
Beijing Pearl Biotech
Curated by ChEMBL
LigandPNGBDBM50113622(CHEMBL3604638)
Affinity DataIC50:  10nM. Assay description: Inhibition of ALK L1196M mutant (unknown origin) using TK substrate-biotin incubated for 30 mins by HTRF assay
In DepthDetails ArticlePubMed