BDBM50113773 2-[(4-Hydroxy-benzylidene)-amino]-3-(1H-indol-3-yl)-propionic acid methyl ester::CHEMBL312502
SMILES COC(=O)[C@@H](Cc1c[nH]c2ccccc12)\N=C\c1ccc(O)cc1
InChI Key InChIKey=JDWRXEQNEOUDRB-JLWFYQMASA-N
Data  1 IC50
  Tab Delimited (TSV)   2D SDfile   Computed 3D by Vconf -m prep SDfile
Find this compound or compounds like it in BindingDB:
Activity Spreadsheet -- Enzyme Inhibition Constant Data from BindingDB
Found 1 hit for monomerid = 50113773
TargetMacrophage migration inhibitory factor(Homo sapiens (Human))
Institute For Medical Research
Curated by ChEMBL
LigandPNGBDBM50113773(2-[(4-Hydroxy-benzylidene)-amino]-3-(1H-indol-3-yl...)
Affinity DataIC50: >5.00E+4nM. Assay description: Inhibition of human macrophage migration inhibitory factor tautomerase (MIF) activity
In DepthDetails ArticlePubMed