BDBM50113774 2-[(4-Hydroxy-benzylidene)-amino]-butyric acid methyl ester::CHEMBL2367596
SMILES CC[C@H](\N=C\c1ccc(O)cc1)C(=O)OC
InChI Key InChIKey=YHYDAMJJXAHERS-ZWSXMNCCSA-N
Data  1 IC50
  Tab Delimited (TSV)   2D SDfile   Computed 3D by Vconf -m prep SDfile
Find this compound or compounds like it in BindingDB:
Activity Spreadsheet -- Enzyme Inhibition Constant Data from BindingDB
Found 1 hit for monomerid = 50113774
TargetMacrophage migration inhibitory factor(Homo sapiens (Human))
Institute For Medical Research
Curated by ChEMBL
LigandPNGBDBM50113774(2-[(4-Hydroxy-benzylidene)-amino]-butyric acid met...)
Affinity DataIC50:  7.00E+4nM. Assay description: Inhibition of human macrophage migration inhibitory factor tautomerase (MIF) activity
In DepthDetails ArticlePubMed