BDBM50113804 4-Anthracen-9-ylmethyl-5-piperidin-4-yl-isoxazol-3-ol; hydrobromide::CHEMBL543125
SMILES O=c1[nH]oc(C2CCNCC2)c1Cc1c2ccccc2cc2ccccc12
InChI Key InChIKey=NUSNKEBTPCBSNA-UHFFFAOYSA-N
Data  1 IC50
  Tab Delimited (TSV)   2D SDfile   Computed 3D by Vconf -m prep SDfile
Find this compound or compounds like it in BindingDB:
Activity Spreadsheet -- Enzyme Inhibition Constant Data from BindingDB
Found 1 hit for monomerid = 50113804
TargetGamma-aminobutyric acid type B receptor subunit 1(Rattus norvegicus (Rat))
The Royal Danish School Of Pharmacy
Curated by ChEMBL
LigandPNGBDBM50113804(4-Anthracen-9-ylmethyl-5-piperidin-4-yl-isoxazol-3...)
Affinity DataIC50: >1.00E+4nM. Assay description: Affinity for GABA-B receptor by inhibiting GABA uptake into rat brain synaptosomes
In DepthDetails ArticlePubMed