BDBM50113998 CHEMBL3605522
SMILES CCn1c(nc2ccc(CN(C)C)cc12)[C@@H](C)NS(=O)(=O)c1ccc(Cl)cc1
InChI Key InChIKey=RPHQHONTYLPFAB-CQSZACIVSA-N
Data  1 EC50
  Tab Delimited (TSV)   2D SDfile   Computed 3D by Vconf -m prep SDfile
Find this compound or compounds like it in BindingDB:
Activity Spreadsheet -- Enzyme Inhibition Constant Data from BindingDB
Found 1 hit for monomerid = 50113998
TargetSphingosine 1-phosphate receptor 1(Homo sapiens (Human))
Astrazeneca
Curated by ChEMBL
LigandPNGBDBM50113998(CHEMBL3605522)
Affinity DataEC50:  2.35E+4nM. Assay description: Antagonist activity against human S1P1 receptor expressed in human U2OS cells co-expressing GFP assessed as inhibition of S1P-induced receptor transl...
In DepthDetails ArticlePubMed