BDBM50114 4-(1-carbomethoxy-2,2,2-trifluoro-1-hydroxy-ethyl)-5-(dimethylaminomethyleneamino)furan-2-carboxylic acid ethyl ester::5-(dimethylaminomethylideneamino)-4-(1,1,1-trifluoro-2-hydroxy-3-methoxy-3-oxopropan-2-yl)-2-furancarboxylic acid ethyl ester::MLS000568991::SMR000150028::cid_5179585::ethyl 5-(dimethylaminomethylideneamino)-4-(1,1,1-trifluoro-2-hydroxy-3-methoxy-3-oxopropan-2-yl)furan-2-carboxylate::ethyl 5-(dimethylaminomethylideneamino)-4-[1,1,1-tris(fluoranyl)-3-methoxy-2-oxidanyl-3-oxidanylidene-propan-2-yl]furan-2-carboxylate
SMILES CCOC(=O)c1cc(c(N=CN(C)C)o1)C(O)(C(=O)OC)C(F)(F)F
InChI Key InChIKey=REDYANPFIXYPAJ-UHFFFAOYSA-N
Data  1 IC50
  Tab Delimited (TSV)   2D SDfile   Computed 3D by Vconf -m prep SDfile
Find this compound or compounds like it in BindingDB:
Activity Spreadsheet -- Enzyme Inhibition Constant Data from BindingDB
Found 1 hit for monomerid = 50114
TargetInduced myeloid leukemia cell differentiation protein Mcl-1(Homo sapiens (Human))
Emory University
Curated by PubChem BioAssay
LigandPNGBDBM50114(4-(1-carbomethoxy-2,2,2-trifluoro-1-hydroxy-ethyl)...)
Affinity DataIC50:  400nM. Assay description: NIH Molecular Libraries Screening Centers Network [MLSCN] Emory Chemical Biology Discovery Center in MLSCN Assay provider: Nikolovska-Coleska, Univer...
In DepthDetails PCBioAssay