BDBM50114069 CHEMBL3605539
SMILES CCn1c(nc2ccc(cc12)C(F)(F)F)[C@@H](C)NS(=O)(=O)c1ccc(CC(C)C)cc1
InChI Key InChIKey=GNFAMJFJZGPKJW-OAHLLOKOSA-N
Data  1 EC50
  Tab Delimited (TSV)   2D SDfile   Computed 3D by Vconf -m prep SDfile
Find this compound or compounds like it in BindingDB:
Activity Spreadsheet -- Enzyme Inhibition Constant Data from BindingDB
Found 1 hit for monomerid = 50114069
TargetSphingosine 1-phosphate receptor 1(Homo sapiens (Human))
Astrazeneca
Curated by ChEMBL
LigandPNGBDBM50114069(CHEMBL3605539)
Affinity DataEC50:  1.80E+3nM. Assay description: Antagonist activity against human S1P1 receptor expressed in human U2OS cells co-expressing GFP assessed as inhibition of S1P-induced receptor transl...
In DepthDetails ArticlePubMed