BDBM50114284 (S)-3-{4-[(3,5-Dichloro-pyridine-4-carbonyl)-amino]-phenyl}-2-(4-methoxy-6-propylamino-[1,3,5]triazin-2-ylamino)-propionic acid::CHEMBL43687
SMILES CCCNc1nc(N[C@@H](Cc2ccc(NC(=O)c3c(Cl)cncc3Cl)cc2)C(O)=O)nc(OC)n1
InChI Key InChIKey=UMEFGQPFQYDAQM-INIZCTEOSA-N
Data  2 IC50
  Tab Delimited (TSV)   2D SDfile   Computed 3D by Vconf -m prep SDfile
Find this compound or compounds like it in BindingDB:
Activity Spreadsheet -- Enzyme Inhibition Constant Data from BindingDB
Found 2 hits for monomerid = 50114284
TargetIntegrin alpha-4/beta-1(Homo sapiens (Human))
Celltech R&D
Curated by ChEMBL
LigandPNGBDBM50114284((S)-3-{4-[(3,5-Dichloro-pyridine-4-carbonyl)-amino...)
Affinity DataIC50:  740nM. Assay description: Inhibition of VLA-4 expressed in Jurkat cell line, in a cell-based adhesion assay.
In DepthDetails ArticlePubMed
TargetIntegrin alpha-4/beta-1(Homo sapiens (Human))
Celltech R&D
Curated by ChEMBL
LigandPNGBDBM50114284((S)-3-{4-[(3,5-Dichloro-pyridine-4-carbonyl)-amino...)
Affinity DataIC50:  25nM. Assay description: Inhibition of VLA-4 expressed in Jurkat cell line, in a cell-based adhesion assay.
In DepthDetails ArticlePubMed