BDBM50114324 4-Methyl-benzoic acid (S)-2-[(S)-2-((R)-2-amino-3-mercapto-propionylamino)-3-methyl-butyrylamino]-2-methoxycarbonyl-ethyl ester::CHEMBL288005
SMILES COC(=O)[C@H](COC(=O)c1ccc(C)cc1)NC(=O)[C@@H](NC(=O)[C@@H](N)CS)C(C)C
InChI Key InChIKey=FRSFADOLCKIPKG-JYJNAYRXSA-N
Data  1 IC50
  Tab Delimited (TSV)   2D SDfile   Computed 3D by Vconf -m prep SDfile
Find this compound or compounds like it in BindingDB:
Activity Spreadsheet -- Enzyme Inhibition Constant Data from BindingDB
Found 1 hit for monomerid = 50114324
TargetProtein farnesyltransferase subunit beta/geranylgeranyltransferase type-1 subunit alpha(Bos taurus (bovine))
Department Of Chemistry And School Of Molecular Science(Bk21)
Curated by ChEMBL
LigandPNGBDBM50114324(4-Methyl-benzoic acid (S)-2-[(S)-2-((R)-2-amino-3-...)
Affinity DataIC50:  920nM. Assay description: In vitro inhibition of bovine Farnesyltrasferase.
In DepthDetails ArticlePubMed