BDBM50114461 4-Amino-2-(3-carbamimidoyl-phenoxy)-N-(2'-sulfamoyl-biphenyl-4-yl)-benzamide::CHEMBL42134
SMILES NC(=N)c1cccc(Oc2cc(N)ccc2C(=O)Nc2ccc(cc2)-c2ccccc2S(N)(=O)=O)c1
InChI Key InChIKey=WIUGTWURTXLLHD-UHFFFAOYSA-N
Data  1 IC50
  Tab Delimited (TSV)   2D SDfile   Computed 3D by Vconf -m prep SDfile
Find this compound or compounds like it in BindingDB:
Activity Spreadsheet -- Enzyme Inhibition Constant Data from BindingDB
Found 1 hit for monomerid = 50114461
TargetCoagulation factor X(Homo sapiens (Human))
Millennium Pharmaceuticals
Curated by ChEMBL
LigandPNGBDBM50114461(4-Amino-2-(3-carbamimidoyl-phenoxy)-N-(2'-sulfamoy...)
Affinity DataIC50:  19nM. Assay description: Tested in vitro for the inhibitory activity against Coagulation factor Xa
In DepthDetails ArticlePubMed