BDBM50114473 2'-Sulfamoyl-biphenyl-4-carboxylic acid [2-(1-amino-isoquinolin-7-yloxy)-phenyl]-amide::CHEMBL47242
SMILES Nc1nccc2ccc(Oc3ccccc3NC(=O)c3ccc(cc3)-c3ccccc3S(N)(=O)=O)cc12
InChI Key InChIKey=JUWFUGYOXYMLNK-UHFFFAOYSA-N
Data  1 IC50
  Tab Delimited (TSV)   2D SDfile   Computed 3D by Vconf -m prep SDfile
Find this compound or compounds like it in BindingDB:
Activity Spreadsheet -- Enzyme Inhibition Constant Data from BindingDB
Found 1 hit for monomerid = 50114473
TargetCoagulation factor X(Homo sapiens (Human))
Millennium Pharmaceuticals
Curated by ChEMBL
LigandPNGBDBM50114473(2'-Sulfamoyl-biphenyl-4-carboxylic acid [2-(1-amin...)
Affinity DataIC50:  646nM. Assay description: Tested in vitro for the inhibitory activity against Coagulation factor Xa
In DepthDetails ArticlePubMed