BDBM50114527 (2R,3R)-3-[(Biphenyl-4-carbonyl)-amino]-2-(3-carbamimidoyl-benzyl)-4-phenyl-butyric acid methyl ester::CHEMBL43264
SMILES COC(=O)[C@H](Cc1cccc(c1)C(N)=N)[C@@H](Cc1ccccc1)NC(=O)c1ccc(cc1)-c1ccccc1
InChI Key InChIKey=RZCGFKOLPIVLDE-FQLXRVMXSA-N
Data  3 KI
  Tab Delimited (TSV)   2D SDfile   Computed 3D by Vconf -m prep SDfile
Find this compound or compounds like it in BindingDB:
Activity Spreadsheet -- Enzyme Inhibition Constant Data from BindingDB
Found 3 hits for monomerid = 50114527
TargetCoagulation factor X(Homo sapiens (Human))
Aventis Pharmaceuticals
Curated by ChEMBL
LigandPNGBDBM50114527((2R,3R)-3-[(Biphenyl-4-carbonyl)-amino]-2-(3-carba...)
Affinity DataKi:  11nM. Assay description: In vitro inhibitory activity against human Coagulation factor Xa
In DepthDetails ArticlePubMed
TargetSerine protease 1(Homo sapiens (Human))
Aventis Pharmaceuticals
Curated by ChEMBL
LigandPNGBDBM50114527((2R,3R)-3-[(Biphenyl-4-carbonyl)-amino]-2-(3-carba...)
Affinity DataKi:  75nM. Assay description: In vitro inhibitory activity against human trypsin
In DepthDetails ArticlePubMed
TargetProthrombin(Homo sapiens (Human))
Aventis Pharmaceuticals
Curated by ChEMBL
LigandPNGBDBM50114527((2R,3R)-3-[(Biphenyl-4-carbonyl)-amino]-2-(3-carba...)
Affinity DataKi:  709nM. Assay description: In vitro inhibitory activity against human Coagulation factor IIa
In DepthDetails ArticlePubMed