BDBM50114580 CHEMBL3609569
SMILES O=C(Nc1cnccn1)Nc1cccc2C(=O)N3CCC4(CC3c12)OCCO4
InChI Key InChIKey=DATQQCAISHVBKS-UHFFFAOYSA-N
Data  1 IC50
  Tab Delimited (TSV)   2D SDfile   Computed 3D by Vconf -m prep SDfile
Find this compound or compounds like it in BindingDB:
Activity Spreadsheet -- Enzyme Inhibition Constant Data from BindingDB
Found 1 hit for monomerid = 50114580
TargetDual specificity tyrosine-phosphorylation-regulated kinase 1A(Homo sapiens (Human))
Cnrs Umr 7311
Curated by ChEMBL
LigandPNGBDBM50114580(CHEMBL3609569)
Affinity DataIC50:  9.30E+4nM. Assay description: Inhibition of human recombinant GST-tagged DYRK1A expressed in Escherichia coli
In DepthDetails ArticlePubMed