BDBM50114784 CHEMBL3609673
SMILES [H][C@@]12C[C@@H](CCN1C(=O)c1cccc(NC(=O)Nc3ccn(C)n3)c21)OC
InChI Key InChIKey=JIJPYLYVOQUHBD-RISCZKNCSA-N
Data  1 IC50
  Tab Delimited (TSV)   2D SDfile   Computed 3D by Vconf -m prep SDfile
Find this compound or compounds like it in BindingDB:
Activity Spreadsheet -- Enzyme Inhibition Constant Data from BindingDB
Found 1 hit for monomerid = 50114784
TargetDual specificity tyrosine-phosphorylation-regulated kinase 1A(Homo sapiens (Human))
Cnrs Umr 7311
Curated by ChEMBL
LigandPNGBDBM50114784(CHEMBL3609673)
Affinity DataIC50: >1.00E+4nM. Assay description: Inhibition of human recombinant GST-tagged DYRK1A expressed in Escherichia coli
In DepthDetails ArticlePubMed