BDBM50114802 CHEMBL3609750
SMILES COc1cc(ccc1-n1ccnc1C)-c1cn(nn1)[C@H]1CCc2c(F)cccc2N(CC(F)(F)F)C1=O
InChI Key InChIKey=BEYPGMAMRURLMJ-QFIPXVFZSA-N
Data  2 IC50
  Tab Delimited (TSV)   2D SDfile   Computed 3D by Vconf -m prep SDfile
Find this compound or compounds like it in BindingDB:
Activity Spreadsheet -- Enzyme Inhibition Constant Data from BindingDB
Found 2 hits for monomerid = 50114802
LigandPNGBDBM50114802(CHEMBL3609750)
Affinity DataIC50:  38nM. Assay description: Modulation of gamma-secretase in human SH-SY5Y cells overexpressing APP C-terminal fragment SPA4CT assessed as inhibition of intracellular amyloid be...
In DepthDetails ArticlePubMed
LigandPNGBDBM50114802(CHEMBL3609750)
Affinity DataIC50:  310nM. Assay description: Modulation of gamma-secretase in human SH-SY5Y cells overexpressing APP C-terminal fragment SPA4CT assessed as inhibition of intracellular amyloid be...
In DepthDetails ArticlePubMed