BDBM50114974 2-Nitro-N-(4-{[(1,2,3,4-tetrahydro-naphthalen-2-ylmethyl)-amino]-methyl}-cyclohexylmethyl)-benzenesulfonamide::2-nitro-N-((4-(((1,2,3,4-tetrahydronaphthalen-2-yl)methylamino)methyl)cyclohexyl)methyl)benzenesulfonamide::CHEMBL299879
SMILES [O-][N+](=O)c1ccccc1S(=O)(=O)NC[C@H]1CC[C@H](CNCC2CCc3ccccc3C2)CC1
InChI Key InChIKey=ISSSVYKMIIAPTH-YGQOYYDZSA-N
Data  6 KI  2 IC50
  Tab Delimited (TSV)   2D SDfile   Computed 3D by Vconf -m prep SDfile
Find this compound or compounds like it in BindingDB:
Activity Spreadsheet -- Enzyme Inhibition Constant Data from BindingDB
Found 8 hits for monomerid = 50114974
TargetNeuropeptide Y receptor type 5(Homo sapiens (Human))
Lundbeck Research Usa
Curated by ChEMBL
LigandPNGBDBM50114974(2-Nitro-N-(4-{[(1,2,3,4-tetrahydro-naphthalen-2-yl...)
Affinity DataKi:  8nM. Assay description: Tested for radioligand binding affinity against membranes from COS-7 cells transiently transfected with Neuropeptide Y receptor type 5
In DepthDetails ArticlePubMed
TargetNeuropeptide Y receptor type 5(Rat 6B)
Lundbeck Research Usa
Curated by ChEMBL
LigandPNGBDBM50114974(2-Nitro-N-(4-{[(1,2,3,4-tetrahydro-naphthalen-2-yl...)
Affinity DataKi:  18nM. Assay description: Functional response of NPY to inhibit forskolin-stimulated cAMP in cells stably transfected with rat Neuropeptide Y receptor type 5
In DepthDetails ArticlePubMed
TargetD(2) dopamine receptor(Homo sapiens (Human))
Lundbeck Research Usa
Curated by ChEMBL
LigandPNGBDBM50114974(2-Nitro-N-(4-{[(1,2,3,4-tetrahydro-naphthalen-2-yl...)
Affinity DataKi:  63nM. Assay description: Binding affinity of the compound against cloned human Dopamine receptor D2 was evaluated
In DepthDetails ArticlePubMed
TargetAlpha-2C adrenergic receptor(Homo sapiens (Human))
Lundbeck Research Usa
Curated by ChEMBL
LigandPNGBDBM50114974(2-Nitro-N-(4-{[(1,2,3,4-tetrahydro-naphthalen-2-yl...)
Affinity DataKi:  100nM. Assay description: Bnding affinity of the compound against cloned human Alpha-2C adrenergic receptor was evaluated
In DepthDetails ArticlePubMed
TargetNeuropeptide Y receptor type 1(Homo sapiens (Human))
Lundbeck Research Usa
Curated by ChEMBL
LigandPNGBDBM50114974(2-Nitro-N-(4-{[(1,2,3,4-tetrahydro-naphthalen-2-yl...)
Affinity DataKi:  1.60E+4nM. Assay description: Tested for radioligand binding affinity against membranes from COS-7 cells transiently transfected with Neuropeptide Y receptor type 1
In DepthDetails ArticlePubMed
TargetNeuropeptide Y receptor type 1(RAT)
Lundbeck Research Usa
Curated by ChEMBL
LigandPNGBDBM50114974(2-Nitro-N-(4-{[(1,2,3,4-tetrahydro-naphthalen-2-yl...)
Affinity DataKi:  2.20E+4nM. Assay description: Functional response of NPY to inhibit forskolin-stimulated cAMP in cells stably transfected with Neuropeptide Y receptor type 1
In DepthDetails ArticlePubMed
TargetCruzipain(Trypanosoma cruzi)
National Human Genome Research Institute
Curated by ChEMBL
LigandPNGBDBM50114974(2-Nitro-N-(4-{[(1,2,3,4-tetrahydro-naphthalen-2-yl...)
Affinity DataIC50: >1.20E+5nM. Assay description: Inhibition of Tryapanosom cruzi cruzain by Flexstation microplate spectrofluorometry
In DepthDetails ArticlePubMed
TargetCruzipain(Trypanosoma cruzi)
National Human Genome Research Institute
Curated by ChEMBL
LigandPNGBDBM50114974(2-Nitro-N-(4-{[(1,2,3,4-tetrahydro-naphthalen-2-yl...)
Affinity DataIC50: >6.00E+4nM. Assay description: Inhibition of Tryapanosom cruzi cruzain by quantitative high throughput screening
In DepthDetails ArticlePubMed