BDBM50115198 CHEMBL3608546
SMILES Cn1cnc(c1)-c1cc2nccc(Oc3ccc(NC(=O)c4cc(-c5ccccc5)n(c4)-c4ccccc4)cc3F)c2s1
InChI Key InChIKey=KNIRVRLUQOCHFV-UHFFFAOYSA-N
Data  2 IC50
  Tab Delimited (TSV)   2D SDfile   Computed 3D by Vconf -m prep SDfile
Find this compound or compounds like it in BindingDB:
Activity Spreadsheet -- Enzyme Inhibition Constant Data from BindingDB
Found 2 hits for monomerid = 50115198
TargetHepatocyte growth factor receptor(Homo sapiens (Human))
Laboratoires Chemrf Inc/Chemrf Laboratories
Curated by ChEMBL
LigandPNGBDBM50115198(CHEMBL3608546)
Affinity DataIC50:  4.84E+3nM. Assay description: Inhibition of c-Met phosphorylation in human MKN45 cells
In DepthDetails ArticlePubMed
TargetMacrophage-stimulating protein receptor(Homo sapiens (Human))
Laboratoires Chemrf Inc/Chemrf Laboratories
Curated by ChEMBL
LigandPNGBDBM50115198(CHEMBL3608546)
Affinity DataIC50:  101nM. Assay description: Inhibition of human RON
In DepthDetails ArticlePubMed