BDBM50115288 CHEMBL3609014
SMILES OB(O)c1ccc(CN(Cc2ccccn2)c2ccc(cn2)C(=O)Nc2ccc(F)cc2)nc1
InChI Key InChIKey=CFKXCSKSSUHXBL-UHFFFAOYSA-N
Data  2 IC50
  Tab Delimited (TSV)   2D SDfile   Computed 3D by Vconf -m prep SDfile
Find this compound or compounds like it in BindingDB:
Activity Spreadsheet -- Enzyme Inhibition Constant Data from BindingDB
Found 2 hits for monomerid = 50115288
TargetC-X-C chemokine receptor type 2(Homo sapiens (Human))
Syntrix Biosystems
Curated by ChEMBL
LigandPNGBDBM50115288(CHEMBL3609014)
Affinity DataIC50:  4.85E+3nM. Assay description: Antagonist activity at CXCR2 (unknown origin) transfected in RBL cells assessed as inhibition of IL-8-mediated intracellular calcium release preincub...
In DepthDetails ArticlePubMed
TargetC-X-C chemokine receptor type 1(Homo sapiens (Human))
Syntrix Biosystems
Curated by ChEMBL
LigandPNGBDBM50115288(CHEMBL3609014)
Affinity DataIC50: >5.00E+3nM. Assay description: Antagonist activity at CXCR1 (unknown origin) transfected in RBL cells assessed as inhibition of IL-8-mediated intracellular calcium release preincub...
In DepthDetails ArticlePubMed