BDBM50115376 2-{2-[2-Acetylamino-3-(3H-imidazol-4-yl)-propionylamino]-3-naphthalen-1-yl-propionylamino}-5-guanidino-pentanoic acid [1-carbamoyl-2-(1H-indol-3-yl)-ethyl]-amide::CHEMBL321870
SMILES CC(=O)N[C@@H](Cc1cnc[nH]1)C(=O)N[C@H](Cc1cccc2ccccc12)C(=O)N[C@@H](CCCNC(N)=N)C(=O)N[C@@H](Cc1c[nH]c2ccccc12)C(N)=O
InChI Key InChIKey=ZJZJSTFJNWUUAH-SSNHPIBPSA-N
Data  4 EC50
  Tab Delimited (TSV)   2D SDfile   Computed 3D by Vconf -m prep SDfile
Find this compound or compounds like it in BindingDB:
Activity Spreadsheet -- Enzyme Inhibition Constant Data from BindingDB
Found 4 hits for monomerid = 50115376
TargetMelanocyte-stimulating hormone receptor(Mus musculus)
University Of Florida
Curated by ChEMBL
LigandPNGBDBM50115376(2-{2-[2-Acetylamino-3-(3H-imidazol-4-yl)-propionyl...)
Affinity DataEC50:  356nM. Assay description: Agonist activity to the mouse Melanocortin-1 receptor (mMC1R)
In DepthDetails ArticlePubMed
TargetMelanocortin receptor 5(Mus musculus (Mouse))
University Of Florida
Curated by ChEMBL
LigandPNGBDBM50115376(2-{2-[2-Acetylamino-3-(3H-imidazol-4-yl)-propionyl...)
Affinity DataEC50:  51.4nM. Assay description: Agonist activity towards mouse Melanocortin-5 receptor (mMC5R)
In DepthDetails ArticlePubMed
TargetMelanocortin receptor 3(Mus musculus)
University Of Florida
Curated by ChEMBL
LigandPNGBDBM50115376(2-{2-[2-Acetylamino-3-(3H-imidazol-4-yl)-propionyl...)
Affinity DataEC50:  4.10E+3nM. Assay description: Agonist activity to the mouse Melanocortin-3 receptor (mMC3R)
In DepthDetails ArticlePubMed
TargetMelanocortin receptor 4(Mus musculus)
University Of Florida
Curated by ChEMBL
LigandPNGBDBM50115376(2-{2-[2-Acetylamino-3-(3H-imidazol-4-yl)-propionyl...)
Affinity DataEC50:  303nM. Assay description: Agonist activity to the mouse Melanocortin-4 receptor (mMC4R)
In DepthDetails ArticlePubMed